{"text_format":"1","workbook":"xlsx","n_sheets":2,"sheets":["計算表","参照表"],"not_rendered":{"charts":0,"images":0,"macros":1,"external_links":0,"defined_names":72,"comments":0,"pivot_tables":0},"unopened":[],"bounds":{"document_bytes":16777216,"sheet_cells":100000,"rows_first":2000,"rows_last":500,"rows_between":2000,"halvings":0,"cell_chars":16384,"cell_head_chars":4096},"cells_cut":0,"cells_raw":0,"read":"whole","date_system":"1900"}

{"sheet":"計算表","index":0,"n_rows":172,"n_cols":91,"rows_kept":172,"cut":false,"hidden":false,"merged":[[0,36,0,46],[20,59,20,69],[0,82,0,99],[6,29,7,31],[10,32,11,32],[10,34,11,34],[6,32,7,32],[19,22,20,22],[21,22,22,22],[34,18,35,18],[36,18,37,18],[41,7,42,7],[41,10,42,10],[43,7,44,7],[43,6,44,6],[42,18,43,18],[10,29,11,31],[0,32,0,34],[8,12,9,21],[30,19,31,19],[30,20,31,20],[30,21,31,21],[33,14,34,14],[33,15,34,15],[33,16,34,16],[38,18,39,18],[40,18,41,18],[35,13,36,13],[35,14,36,14],[35,15,36,15],[11,12,12,21],[43,14,44,14],[41,12,42,12],[29,12,30,12],[31,15,32,15],[31,16,32,16],[31,17,32,17],[17,1,18,1],[17,22,18,22],[48,1,48,2],[19,19,20,21],[21,19,22,21],[26,0,26,2],[17,2,18,18],[17,19,18,21],[19,2,20,18],[21,2,22,18],[19,1,20,1],[21,1,22,1],[43,1,44,5],[29,8,30,8],[41,9,42,9],[43,8,44,8],[30,18,31,18],[32,18,33,18],[43,0,44,0],[37,0,38,0],[29,0,30,0],[31,0,32,0],[33,0,34,0],[35,0,36,0],[56,11,56,12],[29,17,30,17],[41,17,42,17],[43,12,44,12],[29,13,30,13],[29,11,30,11],[43,11,44,11],[43,17,44,17],[43,16,44,16],[41,13,42,13],[43,13,44,13],[41,16,42,16],[41,14,42,14],[41,15,42,15],[29,16,30,16],[41,11,42,11],[29,14,30,14],[29,15,30,15],[54,1,54,26],[51,1,51,26],[8,2,9,3],[8,4,9,9],[8,10,9,11],[29,1,30,5],[41,1,42,5],[41,6,42,6],[29,9,30,9],[29,10,30,10],[11,4,12,9],[28,1,28,5],[11,10,12,11],[41,8,42,8],[11,2,12,3],[16,0,16,2],[29,7,30,7],[29,6,30,6],[41,0,42,0],[33,1,34,5],[33,6,34,6],[33,7,34,7],[33,8,34,8],[33,9,34,9],[37,9,38,9],[37,10,38,10],[52,1,52,26],[53,1,53,26],[30,25,31,26],[49,1,49,26],[50,1,50,26],[30,22,31,22],[30,23,31,23],[43,15,44,15],[31,1,32,5],[43,9,44,9],[37,1,38,5],[37,6,38,6],[33,17,34,17],[35,1,36,5],[35,6,36,6],[35,7,36,7],[35,8,36,8],[35,9,36,9],[35,10,36,10],[35,11,36,11],[35,12,36,12],[43,10,44,10],[35,16,36,16],[35,17,36,17],[37,11,38,11],[37,12,38,12],[37,13,38,13],[37,14,38,14],[37,15,38,15],[33,10,34,10],[33,11,34,11],[33,12,34,12],[33,13,34,13],[31,6,32,6],[31,7,32,7],[31,8,32,8],[31,9,32,9],[31,10,32,10],[31,11,32,11],[31,12,32,12],[31,13,32,13],[31,14,32,14],[34,21,35,21],[34,20,35,20],[34,19,35,19],[34,22,35,22],[34,23,35,23],[34,25,35,26],[37,16,38,16],[37,17,38,17],[39,0,40,0],[39,1,40,5],[39,6,40,6],[39,7,40,7],[39,8,40,8],[39,9,40,9],[39,10,40,10],[39,11,40,11],[39,12,40,12],[39,13,40,13],[39,14,40,14],[39,15,40,15],[39,16,40,16],[39,17,40,17],[37,7,38,7],[37,8,38,8],[38,21,39,21],[38,20,39,20],[38,19,39,19],[38,22,39,22],[38,23,39,23],[38,25,39,26],[42,21,43,21],[42,20,43,20],[42,19,43,19],[42,22,43,22],[42,23,43,23],[42,25,43,26],[40,25,41,26]]}
[null,null,null,null,null,null,"サービス提供体制強化加算計算書　(訪問リハビリテーションを除く)　",null,null,null,null,null,null,null,null,null,null,null,null,null,null,null,null,null,null,null,null,null,null,null,null,"事業所番号",{"$f":"IF(E9=\"\",\"\",E9)","v":""},null,null,"事業所名",{"$f":"IF(M9=\"\",\"\",M9)","v":""}]
[]
[null,null,"◎算定基準をよくご確認の上、管理をお願いします。",null,null,null,null,null,null,null,null,null,null,null,null,null,null,null,null,null,null,null,null,null,null,null,null,null,null,null,null,"◎以下の水色枠部分について、必要事項のご記入をおねがいします.",null,null,null,null,null,null,null,null,null,null,null,null,null,null,null,null,null,null,null,null,null,null,null,null,null,null,"介護職員",{"$f":"SUMIF($BH$23:$BH$172,TRUE,BR$23:BR$172)","v":0},0,0,0,0,0,0,0,0,0,0]
[null,null,"◎以下の水色枠部分について、必要事項のご記入をおねがいします.",null,null,null,null,null,null,null,null,null,null,null,null,null,null,null,null,null,null,null,null,null,null,null,null,null,null,null,null,null,null,null,null,null,null,null,null,null,null,null,null,null,null,null,null,null,null,null,null,null,null,null,null,null,null,null,"訪問介護員",{"$f":"SUMIF($BI$23:$BI$172,TRUE,BR$23:BR$172)","v":0},0,0,0,0,0,0,0,0,0,0]
[null,null,"◎上から順にご記入をお願いします。",null,null,null,null,null,null,null,null,null,null,null,null,null,null,null,null,null,null,null,null,null,null,null,null,null,null,"【事業所情報・職員配置状況】",null,null,null,null,null,null,null,null,null,null,null,null,null,null,null,null,null,null,null,null,null,null,null,null,null,null,null,null,"看護職員及び介護職員",{"$f":"SUMIF($BJ$23:$BJ$172,TRUE,BR$23:BR$172)","v":0},0,0,0,0,0,0,0,0,0,0]
[null,null,"◎加算算定に必要な要件は★印がついた項目です。",null,null,null,null,null,null,null,null,null,null,null,null,null,null,null,null,null,null,null,null,null,null,null,null,null,null,null,null,null,null,null,null,null,"各月の営業日数〔日〕",null,null,null,null,null,null,null,null,null,null,null,null,null,null,null,null,null,null,null,null,null,"従業者",{"$f":"SUMIF($BK$23:$BK$172,TRUE,BR$23:BR$172)","v":0},0,0,0,0,0,0,0,0,0,0]
[null,null,null,null,null,null,null,null,null,null,null,null,null,null,null,null,null,null,null,null,null,null,null,null,null,null,null,null,null,"週当たりの\n営業日数",null,null,null,null,null,null,"4月","5月","6月","7月","8月","9月","10月","11月","12月","1月","2月",null,null,null,null,null,null,null,null,null,null,null,"直接サービスを提供する職員",{"$f":"SUMIF($BL$23:$BL$172,TRUE,BR$23:BR$172)","v":0},0,0,0,0,0,0,0,0,0,0]
[null,null,null,null,null,null,null,null,null,null,null,null,null,null,null,null,null,null,null,null,null,null,null,null,null,null,null,null,null,null,null,null,null,"日間"]
[null,null,"事業所番号",null,null,null,null,null,null,null,"事業所名"]
[null,null,null,null,null,null,null,null,null,null,null,null,null,null,null,null,null,null,null,null,null,null,null,null,null,null,null,null,null,null,null,null,null,null,null,null,"各月の常勤の従業員が勤務すべき時間数〔時間〕"]
[null,null,null,null,null,null,null,null,null,null,null,null,null,null,null,null,null,null,null,null,null,null,null,null,null,null,null,null,null,"常勤の従業員が\n勤務すべき時間数",null,null,null,null,null,null,"4月","5月","6月","7月","8月","9月","10月","11月","12月","1月","2月"]
[null,null,"サービスの種類",null,null,null,null,null,null,null,"算定する\n加算",null,null,null,null,null,null,null,null,null,null,null,null,null,null,null,null,null,null,null,null,null,null,"時間/日",null,"時間/週",{"$f":"ROUND($AI11*AK8/$AG7,0)","v":{"$error":"#DIV/0!"}},{"$error":"#DIV/0!"},{"$error":"#DIV/0!"},{"$error":"#DIV/0!"},{"$error":"#DIV/0!"},{"$error":"#DIV/0!"},{"$error":"#DIV/0!"},{"$error":"#DIV/0!"},{"$error":"#DIV/0!"},{"$error":"#DIV/0!"},{"$error":"#DIV/0!"}]
[]
[null,null,null,null,null,null,null,null,null,null,null,null,null,null,null,null,null,null,null,null,null,null,null,null,null,null,null,null,null,null,null,null,"※保存、印刷前に左の整列ボタンを押して職種ごとに並べ替えた上で保存、印刷してください"]
[]
[]
["【体制要件】",null,null,null,{"$f":"IFERROR(IF(参照表!C11=0,\"\",IF(参照表!C11=1,\"★\",\"★（いずれも満たす）\")),\"\")","v":""}]
[null,"①",{"$f":"参照表!B3","v":{"$error":"#N/A"}},null,null,null,null,null,null,null,null,null,null,null,null,null,null,null,null,null,null,null,{"$f":"IF(C18=\"\",\"\",IF(T18=\"\",\"？\",IF(T18=\"○\",\"○\",\"×\")))","v":{"$error":"#N/A"}}]
[null,null,null,null,null,null,null,null,null,null,null,null,null,null,null,null,null,null,null,null,null,null,null,null,null,null,null,null,null,null,null,"職員確認欄"]
[null,"②",{"$f":"参照表!B4","v":{"$error":"#N/A"}},null,null,null,null,null,null,null,null,null,null,null,null,null,null,null,null,null,null,null,{"$f":"IF(C20=\"\",\"\",IF(T20=\"\",\"？\",IF(T20=\"○\",\"○\",\"×\")))","v":{"$error":"#N/A"}},null,null,null,null,null,null,null,null,{"$f":"IF(COUNTA(AF23:AF172)=0,\"\",COUNTA(AF23:AF172))","v":""},"","","","","","","","","","","","","","",""]
{"$rows_left_out":153}
{"sheet":"参照表","index":1,"n_rows":101,"n_cols":41,"rows_kept":101,"cut":false,"hidden":true,"merged":[[13,9,13,12],[13,13,13,16],[13,17,13,20],[13,21,13,24],[13,25,13,28]]}
[null,{"$f":"MATCH(計算表!E12,参照表!A80:A100,0)","v":{"$error":"#N/A"}},null,{"$f":"MATCH(計算表!M12,参照表!M2:M6,0)","v":{"$error":"#N/A"}}]
["サービス",{"$f":"INDEX($A$80:$A$100,B1)","v":{"$error":"#N/A"}},"区分",{"$f":"IF(D1=0,\"\",INDEX($M$2:$M$6,D1))","v":{"$error":"#N/A"}},"○のうち","○の占める割合が","○%以上である",null,null,"資格","勤続",null,{"$f":"IF(COUNTIFS($A$15:$A$77,$B$2,$B$15:$B$77,\"サービス提供体制強化加算Ⅰ\")=1,\"サービス提供体制強化加算Ⅰ\",\"\")","v":""},null,"介護福祉士",null,null,"介護職員","介護職員","－","－","－","－","－","－","－","－",null,null,"訪問入浴介護",null,"AG2:AI2","管理者","看護職員","介護職員"]
["体制要件1",{"$f":"IF($C$11>0,INDEX($D$11:$H$11,MATCH(1,$D$13:$H$13,0)),\"\")","v":{"$error":"#N/A"}},"人員要件1",{"$f":"IF($I$11>0,INDEX($J$11:$Z$11,MATCH(1,$J$13:$Z$13,0)),\"\")","v":{"$error":"#N/A"}},{"$f":"IFERROR(INDEX($D$11:$AC$11,MATCH($D$3,$C$11:$AC$11,0)),\"\")","v":""},{"$f":"INDEX($D$11:$AC$11,MATCH($D$3,$B$11:$AB$11,0))","v":{"$error":"#N/A"}},{"$f":"IFERROR(INDEX($D$11:$AC$11,MATCH($D$3,$A$11:$AA$11,0)),\"\")","v":""},null,"介護福祉士","計算表!BM23:BM172",null,null,{"$f":"IF(COUNTIFS($A$15:$A$77,$B$2,$B$15:$B$77,\"サービス提供体制強化加算Ⅱ\")=1,\"サービス提供体制強化加算Ⅱ\",\"\")","v":""},null,"実務者研修",null,null,"訪問介護員","訪問介護員",null,null,null,null,null,null,null,null,null,null,"訪問看護",null,"AG3:AI3","管理者","看護職員","OT・PT・ST"]
["体制要件2",{"$f":"IF($C$11>1,INDEX($D$11:$H$11,MATCH(2,$D$13:$H$13,0)),\"\")","v":{"$error":"#N/A"}},"人員要件2",{"$f":"IF($I$11>1,INDEX($J$11:$Z$11,MATCH(2,$J$13:$Z$13,0)),\"\")","v":{"$error":"#N/A"}},{"$f":"IFERROR(INDEX($D$11:$AC$11,MATCH($D$4,$C$11:$AC$11,0)),\"\")","v":""},{"$f":"IF(D4=\"\",\"\",IFERROR(INDEX($D$11:$AC$11,MATCH($D$4,$B$11:$AB$11,0)),\"\"))","v":{"$error":"#N/A"}},{"$f":"IFERROR(IF(D4=\"\",\"\",IFERROR(INDEX($D$11:$AC$11,MATCH($D$4,$A$11:$AA$11,0)),\"\")),\"\")","v":""},null,"勤続10年の介護福祉士","計算表!BM23:BM172",null,null,{"$f":"IF(COUNTIFS($A$15:$A$77,$B$2,$B$15:$B$77,\"サービス提供体制強化加算Ⅲ\")=1,\"サービス提供体制強化加算Ⅲ\",\"\")","v":""},null,"(旧)介護職員基礎研修",null,null,"看護職員及び介護職員","看護職員","介護職員","－","－","－","－","－","－","－",null,null,"通所介護",null,"AG4:AK4","管理者","生活相談員","介護職員","看護職員","機能訓練指導員"]
["体制要件3",{"$f":"IF($C$11>2,INDEX($D$11:$H$11,MATCH(3,$D$13:$H$13,0)),\"\")","v":{"$error":"#N/A"}},"人員要件3",{"$f":"IF($I$11>2,INDEX($J$11:$Z$11,MATCH(3,$J$13:$Z$13,0)),\"\")","v":{"$error":"#N/A"}},{"$f":"IFERROR(IF(D5=\"\",\"\",IFERROR(INDEX($D$11:$AC$11,MATCH($D$5,$C$11:$AC$11,0)),\"\")),\"\")","v":""},{"$f":"IF(D5=\"\",\"\",IFERROR(INDEX($D$11:$AC$11,MATCH($D$5,$B$11:$AB$11,0)),\"\"))","v":{"$error":"#N/A"}},{"$f":"IFERROR(IF(D5=\"\",\"\",IFERROR(INDEX($D$11:$AC$11,MATCH($D$5,$A$11:$AA$11,0)),\"\")),\"\")","v":""},null,"実務者研修修了者等","計算表!BN23:BN172",null,null,{"$f":"IF(COUNTIFS($A$15:$A$77,$B$2,$B$15:$B$77,\"サービス提供体制強化加算Ⅲイ\")=1,\"サービス提供体制強化加算Ⅲイ\",\"\")","v":""},null,"その他",null,null,"従業者","－","－","－","－","－","－","－","－","－",null,null,"通所リハビリテーション",null,"AG5:AK5","医師","OT・PT・ST","看護職員","介護職員","柔道整復師等"]
[null,null,"人員要件4",{"$f":"IF($I$11>3,INDEX($J$11:$Z$11,MATCH(4,$J$13:$Z$13,0)),\"\")","v":{"$error":"#N/A"}},{"$f":"IFERROR(IF(D6=\"\",\"\",IFERROR(INDEX($D$11:$AC$11,MATCH($D$6,$C$11:$AC$11,0)),\"\")),\"\")","v":""},{"$f":"IF(D6=\"\",\"\",IFERROR(INDEX($D$11:$AC$11,MATCH($D$6,$B$11:$AB$11,0)),\"\"))","v":{"$error":"#N/A"}},{"$f":"IFERROR(IF(D6=\"\",\"\",IFERROR(INDEX($D$11:$AC$11,MATCH($D$6,$A$11:$AA$11,0)),\"\")),\"\")","v":""},null,"常勤の者",null,null,null,{"$f":"IF(COUNTIFS($A$15:$A$77,$B$2,$B$15:$B$77,\"サービス提供体制強化加算Ⅲロ\")=1,\"サービス提供体制強化加算Ⅲロ\",\"\")","v":""},null,null,null,null,"直接サービスを提供する職員","生活相談員","介護職員","看護職員","機能訓練指導員","OT・PT・ST","柔道整復師等","支援相談員","訪問介護員","訪問看護員",null,null,"短期入所生活介護",null,"AG6:AM6","医師","生活相談員","介護職員","看護職員","栄養士","機能訓練指導員","調理員その他"]
[null,null,null,null,{"$f":"E3","v":""},null,null,null,"勤続3年以上の者",null,null,null,null,null,null,null,null,null,null,null,null,null,null,null,null,null,null,null,null,"短期入所療養介護",null,"AG7:AO7","医師","薬剤師","看護職員","介護職員","支援相談員","OT・PT・ST","栄養士","介護支援専門員","調理員・事務員その他"]
[null,null,null,null,{"$f":"IF(COUNTIF($E$3:$E$6,E7)=I11,\"\",IF($E$3=$E$4,IF($E$3=$E$5,$E$6,$E$5),$E$4))","v":{"$error":"#N/A"}},null,null,null,"勤続7年以上の者",null,null,null,null,null,null,null,null,null,null,null,null,null,null,null,null,null,null,null,null,"特定施設入居者生活介護",null,"AG8:AL8","管理者","生活相談員","介護職員","看護職員","機能訓練指導員","計画作成担当者"]
[null,null,null,null,{"$f":"IF(COUNTIF($E$3:$E$6,E7)+COUNTIF($E$3:$E$6,E8)=I11,\"\",IF(E7=E4,E6,IF(E8=E5,E6,E5)))","v":{"$error":"#N/A"}},null,null,null,null,null,null,null,null,null,null,null,null,null,null,null,null,null,null,null,null,null,null,null,null,"定期巡回・随時対応型訪問介護看護",null,"AG9:AL9","管理者","オペレーター","計画作成担当者","訪問介護員","訪問看護員","OT・PT・ST"]
[null,null,null,null,null,null,null,null,null,null,null,null,null,null,null,null,null,null,null,null,null,null,null,null,null,null,null,null,null,"夜間対応型訪問介護",null,"AG10:AJ10","管理者","オペレーター","面接相談員","訪問介護員"]
[null,null,{"$f":"INDEX(C15:C77,MATCH($B$2&$D$2,$A$15:$A$77&$B$15:$B$77,0))","v":{"$error":"#N/A"}},{"$f":"INDEX(D15:D77,MATCH($B$2&$D$2,$A$15:$A$77&$B$15:$B$77,0))","v":{"$error":"#N/A"}},{"$f":"INDEX(E15:E77,MATCH($B$2&$D$2,$A$15:$A$77&$B$15:$B$77,0))","v":{"$error":"#N/A"}},{"$f":"INDEX(F15:F77,MATCH($B$2&$D$2,$A$15:$A$77&$B$15:$B$77,0))","v":{"$error":"#N/A"}},{"$f":"INDEX(G15:G77,MATCH($B$2&$D$2,$A$15:$A$77&$B$15:$B$77,0))","v":{"$error":"#N/A"}},{"$f":"INDEX(H15:H77,MATCH($B$2&$D$2,$A$15:$A$77&$B$15:$B$77,0))","v":{"$error":"#N/A"}},{"$f":"INDEX(I15:I77,MATCH($B$2&$D$2,$A$15:$A$77&$B$15:$B$77,0))","v":{"$error":"#N/A"}},{"$f":"INDEX(J15:J77,MATCH($B$2&$D$2,$A$15:$A$77&$B$15:$B$77,0))","v":{"$error":"#N/A"}},{"$f":"INDEX(K15:K77,MATCH($B$2&$D$2,$A$15:$A$77&$B$15:$B$77,0))","v":{"$error":"#N/A"}},{"$f":"INDEX(L15:L77,MATCH($B$2&$D$2,$A$15:$A$77&$B$15:$B$77,0))","v":{"$error":"#N/A"}},{"$f":"INDEX(M15:M77,MATCH($B$2&$D$2,$A$15:$A$77&$B$15:$B$77,0))","v":{"$error":"#N/A"}},{"$f":"INDEX(N15:N77,MATCH($B$2&$D$2,$A$15:$A$77&$B$15:$B$77,0))","v":{"$error":"#N/A"}},{"$f":"INDEX(O15:O77,MATCH($B$2&$D$2,$A$15:$A$77&$B$15:$B$77,0))","v":{"$error":"#N/A"}},{"$f":"INDEX(P15:P77,MATCH($B$2&$D$2,$A$15:$A$77&$B$15:$B$77,0))","v":{"$error":"#N/A"}},{"$f":"INDEX(Q15:Q77,MATCH($B$2&$D$2,$A$15:$A$77&$B$15:$B$77,0))","v":{"$error":"#N/A"}},{"$f":"INDEX(R15:R77,MATCH($B$2&$D$2,$A$15:$A$77&$B$15:$B$77,0))","v":{"$error":"#N/A"}},{"$f":"INDEX(S15:S77,MATCH($B$2&$D$2,$A$15:$A$77&$B$15:$B$77,0))","v":{"$error":"#N/A"}},{"$f":"INDEX(T15:T77,MATCH($B$2&$D$2,$A$15:$A$77&$B$15:$B$77,0))","v":{"$error":"#N/A"}},{"$f":"INDEX(U15:U77,MATCH($B$2&$D$2,$A$15:$A$77&$B$15:$B$77,0))","v":{"$error":"#N/A"}},{"$f":"INDEX(V15:V77,MATCH($B$2&$D$2,$A$15:$A$77&$B$15:$B$77,0))","v":{"$error":"#N/A"}},{"$f":"INDEX(W15:W77,MATCH($B$2&$D$2,$A$15:$A$77&$B$15:$B$77,0))","v":{"$error":"#N/A"}},{"$f":"INDEX(X15:X77,MATCH($B$2&$D$2,$A$15:$A$77&$B$15:$B$77,0))","v":{"$error":"#N/A"}},{"$f":"INDEX(Y15:Y77,MATCH($B$2&$D$2,$A$15:$A$77&$B$15:$B$77,0))","v":{"$error":"#N/A"}},{"$f":"INDEX(Z15:Z77,MATCH($B$2&$D$2,$A$15:$A$77&$B$15:$B$77,0))","v":{"$error":"#N/A"}},{"$f":"INDEX(AA15:AA77,MATCH($B$2&$D$2,$A$15:$A$77&$B$15:$B$77,0))","v":{"$error":"#N/A"}},{"$f":"INDEX(AB15:AB77,MATCH($B$2&$D$2,$A$15:$A$77&$B$15:$B$77,0))","v":{"$error":"#N/A"}},{"$f":"INDEX(AC15:AC77,MATCH($B$2&$D$2,$A$15:$A$77&$B$15:$B$77,0))","v":{"$error":"#N/A"}},"地域密着型通所介護",null,"AG11:AK11","管理者","生活相談員","介護職員","看護職員","機能訓練指導員"]
[null,null,null,{"$f":"IF(D11=\"－\",0,1)","v":{"$error":"#N/A"}},{"$f":"IF(E11=\"－\",0,1)","v":{"$error":"#N/A"}},{"$f":"IF(F11=\"－\",0,1)","v":{"$error":"#N/A"}},{"$f":"IF(G11=\"－\",0,1)","v":{"$error":"#N/A"}},{"$f":"IF(H11=\"－\",0,1)","v":{"$error":"#N/A"}},null,{"$f":"IF(J11=\"－\",0,1)","v":{"$error":"#N/A"}},null,null,null,{"$f":"IF(N11=\"－\",0,1)","v":{"$error":"#N/A"}},null,null,null,{"$f":"IF(R11=\"－\",0,1)","v":{"$error":"#N/A"}},null,null,null,{"$f":"IF(V11=\"－\",0,1)","v":{"$error":"#N/A"}},null,null,null,{"$f":"IF(Z11=\"－\",0,1)","v":{"$error":"#N/A"}},null,null,null,"療養通所介護",null,"AG12:AK12","管理者","生活相談員","介護職員","看護職員","機能訓練指導員"]
[null,null,null,{"$f":"SUM($D$12:D12)","v":{"$error":"#N/A"}},{"$f":"SUM($D$12:E12)","v":{"$error":"#N/A"}},{"$f":"SUM($D$12:F12)","v":{"$error":"#N/A"}},{"$f":"SUM($D$12:G12)","v":{"$error":"#N/A"}},{"$f":"SUM($D$12:H12)","v":{"$error":"#N/A"}},null,{"$f":"SUM($J$12:J12)","v":{"$error":"#N/A"}},null,null,null,{"$f":"SUM($J$12:N12)","v":{"$error":"#N/A"}},null,null,null,{"$f":"SUM($J$12:R12)","v":{"$error":"#N/A"}},null,null,null,{"$f":"SUM($J$12:V12)","v":{"$error":"#N/A"}},null,null,null,{"$f":"SUM($J$12:Z12)","v":{"$error":"#N/A"}},null,null,null,"認知症対応型通所介護",null,"AG13:AK13","管理者","生活相談員","介護職員","看護職員","機能訓練指導員"]
["サービス","区分","体制要件","研修","伝達","健康","質","基準","人員要件","介福",null,null,null,"介福＋勤続",null,null,null,"介福等",null,null,null,"常勤",null,null,null,"勤続",null,null,null,"小規模多機能型居宅介護",null,"AG14:AJ14","管理者","介護支援専門員","介護職員","看護職員"]
["訪問入浴介護","サービス提供体制強化加算Ⅰ",{"$f":"5-COUNTIF(D15:H15,\"－\")","v":3},"全ての従業者に対し、従業者ごとに研修計画を策定し、研修の実施をしている又は実施することが予定されている。","留意事項の伝達や従業者の技術指導を目的とした会議を定期的に開催している。","全ての従業者に対し、健康診断等の定期的に実施している。","－","－",{"$f":"5-COUNTIF(J15:Z15,\"－\")","v":2},"介護職員のうち、介護福祉士の占める割合が60%以上である","介護職員","介護福祉士",{"$f":"IF(K15=\"\",\"\",VALUE(MID(J15,FIND(\"%\",J15)-2,2)))","v":60},"介護職員のうち、勤続10年以上の介護福祉士の占める割合が25%以上である","介護職員","勤続10年以上の介護福祉士",{"$f":"IF(O15=\"\",\"\",VALUE(MID(N15,FIND(\"%\",N15)-2,2)))","v":25},"－",null,null,null,"－",null,null,null,"－",null,null,null,"認知症対応型共同生活介護",null,"AG15:AJ15","管理者","計画作成担当者","介護職員","看護職員"]
["訪問入浴介護","サービス提供体制強化加算Ⅱ",3,"全ての従業者に対し、従業者ごとに研修計画を策定し、研修の実施をしている又は実施することが予定されている。","留意事項の伝達や従業者の技術指導を目的とした会議を定期的に開催している。","全ての従業者に対し、健康診断等の定期的に実施している。","－","－",2,"介護職員のうち、介護福祉士の占める割合が40%以上である","介護職員",{"$f":"IF(K16=\"\",\"\",$L$15)","v":"介護福祉士"},40,"－",null,{"$f":"IF(O16=\"\",\"\",$P$15)","v":""},"","介護職員のうち、介護福祉士、実務者研修修了者及び介護職員基礎研修修了者の占める割合が60%以上である","介護職員","実務者研修修了者等",{"$f":"IF(S16=\"\",\"\",VALUE(MID(R16,FIND(\"%\",R16)-2,2)))","v":60},"－",null,null,null,"－",null,null,null,"地域密着型特定施設入居者生活介護",null,"AG16:AL16","管理者","生活相談員","介護職員","看護職員","機能訓練指導員","計画作成担当者"]
["訪問入浴介護","サービス提供体制強化加算Ⅲ",3,"全ての従業者に対し、従業者ごとに研修計画を策定し、研修の実施をしている又は実施することが予定されている。","留意事項の伝達や従業者の技術指導を目的とした会議を定期的に開催している。","全ての従業者に対し、健康診断等の定期的に実施している。","－","－",{"$f":"5-COUNTIF(J17:Z17,\"－\")","v":3},"介護職員のうち、介護福祉士の占める割合が30%以上である","介護職員",{"$f":"IF(K17=\"\",\"\",$L$15)","v":"介護福祉士"},30,"－",null,{"$f":"IF(O17=\"\",\"\",$P$15)","v":""},"","介護職員のうち、介護福祉士、実務者研修修了者及び介護職員基礎研修修了者の占める割合が50%以上である","介護職員","実務者研修修了者等",{"$f":"IF(S17=\"\",\"\",VALUE(MID(R17,FIND(\"%\",R17)-2,2)))","v":50},"－",null,null,null,"従業者のうち、勤続7年以上の者の占める割合が30%以上である",{"$f":"IF(Z17=$Z$16,\"\",LEFT(Z17,FIND(\"のうち\",Z17)-1))","v":"従業者"},{"$f":"IF(AA17=\"\",\"\",\"勤続\"&VALUE(MID(Z17,FIND(\"勤続\",Z17)+2,FIND(\"年\",Z17)-FIND(\"勤続\",Z17)-2))&\"年以上の者\")","v":"勤続7年以上の者"},{"$f":"IF(AA17=\"\",\"\",VALUE(MID(Z17,FIND(\"%\",Z17)-2,2)))","v":30},"地域密着型介護老人福祉施設",null,"AG17:AM17","医師","生活相談員","介護職員","看護職員","栄養士","機能訓練指導員","介護支援専門員"]
["訪問看護","サービス提供体制強化加算Ⅰ",3,"全ての従業者に対し、従業者ごとに研修計画を策定し、研修の実施をしている又は実施することが予定されている。","留意事項の伝達や従業者の技術指導を目的とした会議を定期的に開催している。","全ての従業者に対し、健康診断等の定期的に実施している。","－","－",1,"－",null,"","","－",null,"","","－",null,null,null,"－",null,null,null,"従業者のうち、勤続7年以上の者の占める割合が30%以上である",{"$f":"IF(Z18=$Z$16,\"\",LEFT(Z18,FIND(\"のうち\",Z18)-1))","v":"従業者"},{"$f":"IF(AA18=\"\",\"\",\"勤続\"&VALUE(MID(Z18,FIND(\"勤続\",Z18)+2,FIND(\"年\",Z18)-FIND(\"勤続\",Z18)-2))&\"年以上の者\")","v":"勤続7年以上の者"},30,"看護小規模多機能型居宅介護",null,"AG18:AJ18","管理者","介護支援専門員","介護職員","看護職員"]
["訪問看護","サービス提供体制強化加算Ⅱ",3,"全ての従業者に対し、従業者ごとに研修計画を策定し、研修の実施をしている又は実施することが予定されている。","留意事項の伝達や従業者の技術指導を目的とした会議を定期的に開催している。","全ての従業者に対し、健康診断等の定期的に実施している。","－","－",1,"－",null,"","","－",null,"","","－",null,null,null,"－",null,null,null,"従業者のうち、勤続3年以上の者の占める割合が30%以上である","従業者","勤続3年以上の者",30,"介護老人福祉施設",null,"AG19:AN19","施設長","医師","生活相談員","介護職員","看護職員","栄養士","機能訓練指導員","調理員・事務員その他"]
["訪問リハビリテーション","サービス提供体制強化加算Ⅰ",0,"－","－","－","－","－",1,"－",null,"","","－",null,"","","－",null,null,null,"－",null,null,null,"直接サービスを提供する理学療法士、作業療法士又は言語聴覚士のうち、勤続7年以上の者がいる","直接サービスを提供するPT、OT又はST","勤続7年以上の者",null,"介護老人保健施設",null,"AG20:AO20","医師","薬剤師","看護職員","介護職員","支援相談員","OT・PT・ST","栄養士","介護支援専門員","調理員・事務員その他"]
{"$rows_left_out":81}